Reaction Details
TargetCholecystokinin receptor type A
LigandBDBM50037867
Substrate/Competitorn/a
Meas. Tech.ChEMBL_49715 (CHEMBL661792)
IC50 4.2±n/a nM
Citation Lowe, JAHageman, DLDrozda, SEMcLean, SBryce, DKCrawford, RTZorn, SMorrone, JBordner, J 5-Phenyl-3-ureidobenzazepin-2-ones as cholecystokinin-B receptor antagonists. J Med Chem37:3789-811 (1994) Cholecystokinin receptor type A
Name:Cholecystokinin receptor type A
Type:n/a
Mol. Mass.:48229.77
Organism:Cavia porcellus
Description:n/a
Residue:430
BDBM50037867
NameBDBM50037867
Synonyms:CHEMBL126865 | N-tert-Butyl-2-{(3R,5R)-3-[3-(3-chloro-phenyl)-ureido]-2-oxo-5-phenyl-2,3,4,5-tetrahydro-benzo[b]azepin-1-yl}-N-methyl-acetamide
TypeSmall organic molecule
Emp. Form.C30H33ClN4O3
Mol. Mass.533.061
SMILESCN(C(=O)CN1c2ccccc2[C@H](C[C@@H](NC(=O)Nc2cccc(Cl)c2)C1=O)c1ccccc1)C(C)(C)C