Reaction Details
TargetGastrin/cholecystokinin type B receptor
LigandBDBM50037846
Substrate/Competitorn/a
Meas. Tech.ChEMBL_47965 (CHEMBL653979)
IC50 32±n/a nM
Citation Lowe, JAHageman, DLDrozda, SEMcLean, SBryce, DKCrawford, RTZorn, SMorrone, JBordner, J 5-Phenyl-3-ureidobenzazepin-2-ones as cholecystokinin-B receptor antagonists. J Med Chem37:3789-811 (1994) Gastrin/cholecystokinin type B receptor
Name:Gastrin/cholecystokinin type B receptor
Type:G Protein-Coupled Receptor (GPCR)
Mol. Mass.:48445.79
Organism:Homo sapiens (Human)
Description:Stable expression of human CCK-2 receptors in HEK 293 cells.
Residue:447
BDBM50037846
NameBDBM50037846
Synonyms:CHEMBL126002 | N-tert-Butyl-2-{(3R,5R)-3-[3-(3-chloro-phenyl)-ureido]-7-methyl-2-oxo-5-phenyl-2,3,4,5-tetrahydro-benzo[b]azepin-1-yl}-acetamide
TypeSmall organic molecule
Emp. Form.C30H33ClN4O3
Mol. Mass.533.061
SMILESCc1ccc2N(CC(=O)NC(C)(C)C)C(=O)[C@@H](C[C@H](c3ccccc3)c2c1)NC(=O)Nc1cccc(Cl)c1