Reaction Details
TargetGastrin/cholecystokinin type B receptor
LigandBDBM50037862
Substrate/Competitorn/a
Meas. Tech.ChEMBL_47965 (CHEMBL653979)
IC50 55±n/a nM
Citation Lowe, JAHageman, DLDrozda, SEMcLean, SBryce, DKCrawford, RTZorn, SMorrone, JBordner, J 5-Phenyl-3-ureidobenzazepin-2-ones as cholecystokinin-B receptor antagonists. J Med Chem37:3789-811 (1994) Gastrin/cholecystokinin type B receptor
Name:Gastrin/cholecystokinin type B receptor
Type:G Protein-Coupled Receptor (GPCR)
Mol. Mass.:48445.79
Organism:Homo sapiens (Human)
Description:Stable expression of human CCK-2 receptors in HEK 293 cells.
Residue:447
BDBM50037862
NameBDBM50037862
Synonyms:CHEMBL127687 | N-tert-Butyl-2-[(3R,5R)-2-oxo-5-phenyl-3-(3-o-tolyl-ureido)-2,3,4,5-tetrahydro-benzo[b]azepin-1-yl]-acetamide
TypeSmall organic molecule
Emp. Form.C30H34N4O3
Mol. Mass.498.616
SMILESCc1ccccc1NC(=O)N[C@@H]1C[C@H](c2ccccc2)c2ccccc2N(CC(=O)NC(C)(C)C)C1=O