Reaction Details
TargetCarbonic anhydrase 1
LigandBDBM50344898
Substrate/Competitorn/a
Meas. Tech.ChEMBL_975723 (CHEMBL2415221)
Ki 101000±n/a nM
Citation Pan, PVermelho, ABScozzafava, AParkkila, SCapasso, CSupuran, CT Anion inhibition studies of the ?-carbonic anhydrase from the protozoan pathogen Trypanosoma cruzi, the causative agent of Chagas disease. Bioorg Med Chem21:4472-6 (2013) 
 
Carbonic anhydrase 1
Name:Carbonic anhydrase 1
Type:Enzyme
Mol. Mass.:28873.37
Organism:Homo sapiens (Human)
Description:P00915
Residue:261
BDBM50344898
NameBDBM50344898
Synonyms:CHEMBL1081267 | sodium perruthenate
TypeSmall organic molecule
Emp. Form.O4Ru
Mol. Mass.165.07
SMILESO=[Ru-](=O)(=O)=O