Reaction Details
Target5-hydroxytryptamine receptor 2A
LigandBDBM50038687
Substrate/Competitorn/a
Meas. Tech.ChEMBL_2497 (CHEMBL617384)
Ki 13±n/a nM
Citation Glennon, RADukat, Mel-Bermawy, MLaw, HDe los Angeles, JTeitler, MKing, AHerrick-Davis, K Influence of amine substituents on 5-HT2A versus 5-HT2C binding of phenylalkyl- and indolylalkylamines. J Med Chem37:1929-35 (1994) 5-hydroxytryptamine receptor 2A
Name:5-hydroxytryptamine receptor 2A
Type:undefined
Mol. Mass.:52607.65
Organism:Homo sapiens (Human)
Description:P28223
Residue:471
BDBM50038687
NameBDBM50038687
Synonyms:CHEMBL58133 | [2-(5-Methoxy-1H-indol-3-yl)-ethyl]-(4-phenyl-butyl)-amine
TypeSmall organic molecule
Emp. Form.C21H26N2O
Mol. Mass.322.4439
SMILESCOc1ccc2[nH]cc(CCNCCCCc3ccccc3)c2c1