Reaction Details
Target5-hydroxytryptamine receptor 2A
LigandBDBM50038667
Substrate/Competitorn/a
Meas. Tech.ChEMBL_2497 (CHEMBL617384)
Ki 58±n/a nM
Citation Glennon, RADukat, Mel-Bermawy, MLaw, HDe los Angeles, JTeitler, MKing, AHerrick-Davis, K Influence of amine substituents on 5-HT2A versus 5-HT2C binding of phenylalkyl- and indolylalkylamines. J Med Chem37:1929-35 (1994) 5-hydroxytryptamine receptor 2A
Name:5-hydroxytryptamine receptor 2A
Type:undefined
Mol. Mass.:52607.65
Organism:Homo sapiens (Human)
Description:P28223
Residue:471
BDBM50038667
NameBDBM50038667
Synonyms:CHEMBL418319 | [2-(4-Bromo-2,5-dimethoxy-phenyl)-ethyl]-(4-nitro-benzyl)-amine
TypeSmall organic molecule
Emp. Form.C17H19BrN2O4
Mol. Mass.395.248
SMILESCOc1cc(CCNCc2ccc(cc2)[N+]([O-])=O)c(OC)cc1Br