Reaction Details
Target5-hydroxytryptamine receptor 2C
LigandBDBM50038675
Substrate/Competitorn/a
Meas. Tech.ChEMBL_2842 (CHEMBL621527)
Ki 48±n/a nM
Citation Glennon, RADukat, Mel-Bermawy, MLaw, HDe los Angeles, JTeitler, MKing, AHerrick-Davis, K Influence of amine substituents on 5-HT2A versus 5-HT2C binding of phenylalkyl- and indolylalkylamines. J Med Chem37:1929-35 (1994) 5-hydroxytryptamine receptor 2C
Name:5-hydroxytryptamine receptor 2C
Type:Enzyme
Mol. Mass.:51935.10
Organism:Rattus norvegicus (Rat)
Description:P08909
Residue:460
BDBM50038675
NameBDBM50038675
Synonyms:(4-Bromo-benzyl)-[2-(4-bromo-2,5-dimethoxy-phenyl)-ethyl]-amine | CHEMBL294902
TypeSmall organic molecule
Emp. Form.C17H19Br2NO2
Mol. Mass.429.146
SMILESCOc1cc(CCNCc2ccc(Br)cc2)c(OC)cc1Br