Reaction Details
TargetAcetylcholinesterase
LigandBDBM50038731
Substrate/Competitorn/a
Meas. Tech.ChEMBL_28920 (CHEMBL637740)
IC50 136±n/a nM
Citation Chen, YLListon, DNielsen, JChapin, DDunaiskis, AHedberg, KIves, JJohnson, JJones, S Syntheses and anticholinesterase activity of tetrahydrobenzazepine carbamates. J Med Chem37:1996-2000 (1994) Acetylcholinesterase
Name:Acetylcholinesterase
Type:Enzyme
Mol. Mass.:68165.65
Organism:Mus musculus (mouse)
Description:n/a
Residue:614
BDBM50038731
NameBDBM50038731
Synonyms:1,2,3,4-Tetrahydro-acridine | CHEMBL292518
TypeSmall organic molecule
Emp. Form.C13H13N
Mol. Mass.183.249
SMILESC1CCc2nc3ccccc3cc2C1