Reaction Details
TargetAcetylcholinesterase
LigandBDBM10972
Substrate/Competitorn/a
Meas. Tech.ChEMBL_28918 (CHEMBL637738)
IC50 148±n/a nM
Citation Chen, YLListon, DNielsen, JChapin, DDunaiskis, AHedberg, KIves, JJohnson, JJones, S Syntheses and anticholinesterase activity of tetrahydrobenzazepine carbamates. J Med Chem37:1996-2000 (1994) Acetylcholinesterase
Name:Acetylcholinesterase
Type:Enzyme
Mol. Mass.:68165.65
Organism:Mus musculus (mouse)
Description:n/a
Residue:614
BDBM10972
NameBDBM10972
Synonyms:(3aS,8aR)-1,3a,8-trimethyl-1H,2H,3H,3aH,8H,8aH-pyrrolo[2,3-b]indol-5-yl N-heptylcarbamate Eptastigmine | Heptylphysostigmine
TypeSmall organic molecule
Emp. Form.C21H33N3O2
Mol. Mass.359.5056
SMILES[H][C@]12N(C)CC[C@@]1(C)c1cc(OC(=O)NCCCCCCC)ccc1N2C