Reaction Details
TargetAcetylcholinesterase
LigandBDBM50038734
Substrate/Competitorn/a
Meas. Tech.ChEMBL_28916 (CHEMBL637736)
IC50 159±n/a nM
Citation Chen, YLListon, DNielsen, JChapin, DDunaiskis, AHedberg, KIves, JJohnson, JJones, S Syntheses and anticholinesterase activity of tetrahydrobenzazepine carbamates. J Med Chem37:1996-2000 (1994) Acetylcholinesterase
Name:Acetylcholinesterase
Type:Enzyme
Mol. Mass.:68165.65
Organism:Mus musculus (mouse)
Description:n/a
Residue:614
BDBM50038734
NameBDBM50038734
Synonyms:CHEMBL64529 | Heptyl-carbamic acid 9-methyl-9-aza-tricyclo[6.3.1.0*2,7*]dodeca-2,4,6-trien-4-yl ester
TypeSmall organic molecule
Emp. Form.C20H30N2O2
Mol. Mass.330.4644
SMILESCCCCCCCNC(=O)Oc1ccc2C3CC(CCN3C)c2c1