Reaction Details
TargetAcetylcholinesterase
LigandBDBM50038740
Substrate/Competitorn/a
Meas. Tech.ChEMBL_28914 (CHEMBL638612)
IC50 148±n/a nM
Citation Chen, YLListon, DNielsen, JChapin, DDunaiskis, AHedberg, KIves, JJohnson, JJones, S Syntheses and anticholinesterase activity of tetrahydrobenzazepine carbamates. J Med Chem37:1996-2000 (1994) Acetylcholinesterase
Name:Acetylcholinesterase
Type:Enzyme
Mol. Mass.:68165.65
Organism:Mus musculus (mouse)
Description:n/a
Residue:614
BDBM50038740
NameBDBM50038740
Synonyms:CHEMBL61274 | Hexyl-carbamic acid 9-methyl-9-aza-tricyclo[6.3.1.0*2,7*]dodeca-2,4,6-trien-4-yl ester
TypeSmall organic molecule
Emp. Form.C19H28N2O2
Mol. Mass.316.4378
SMILESCCCCCCNC(=O)Oc1ccc2C3CC(CCN3C)c2c1