Reaction Details
TargetAcetylcholinesterase
LigandBDBM50038738
Substrate/Competitorn/a
Meas. Tech.ChEMBL_28303 (CHEMBL645002)
IC50 169±n/a nM
Citation Chen, YLListon, DNielsen, JChapin, DDunaiskis, AHedberg, KIves, JJohnson, JJones, S Syntheses and anticholinesterase activity of tetrahydrobenzazepine carbamates. J Med Chem37:1996-2000 (1994) Acetylcholinesterase
Name:Acetylcholinesterase
Type:Enzyme
Mol. Mass.:67792.70
Organism:Homo sapiens (Human)
Description:P22303
Residue:614
BDBM50038738
NameBDBM50038738
Synonyms:CHEMBL292421 | Heptyl-carbamic acid 9-ethyl-9-aza-tricyclo[6.3.1.0*2,7*]dodeca-2,4,6-trien-4-yl ester
TypeSmall organic molecule
Emp. Form.C21H32N2O2
Mol. Mass.344.491
SMILESCCCCCCCNC(=O)Oc1ccc2C3CC(CCN3CC)c2c1