Reaction Details
TargetEpidermal growth factor receptor
LigandBDBM50039087
Substrate/Competitorn/a
Meas. Tech.ChEMBL_63758 (CHEMBL679946)
IC50>20000±n/a nM
Citation Maguire, MPSheets, KRMcVety, KSpada, APZilberstein, A A new series of PDGF receptor tyrosine kinase inhibitors: 3-substituted quinoline derivatives. J Med Chem37:2129-37 (1994) Epidermal growth factor receptor
Name:Epidermal growth factor receptor
Type:Receptor Kinase Domain
Mol. Mass.:134279.59
Organism:Homo sapiens (Human)
Description:P00533
Residue:1210
BDBM50039087
NameBDBM50039087
Synonyms:3-(3-Fluoro-4-methoxy-phenyl)-6,7-dimethoxy-quinoline | CHEMBL67436
TypeSmall organic molecule
Emp. Form.C18H16FNO3
Mol. Mass.313.3229
SMILESCOc1ccc(cc1F)-c1cnc2cc(OC)c(OC)cc2c1