Reaction Details
Target5-hydroxytryptamine receptor 2C
LigandBDBM50028600
Substrate/Competitorn/a
Meas. Tech.ChEMBL_2817 (CHEMBL617846)
Ki 3±n/a nM
Citation Phillips, STde Paulis, TBaron, BMSiegel, BWSeeman, PVan Tol, HHGuan, HCSmith, HE Binding of 5H-dibenzo[b,e][1,4]diazepine and chiral 5H-dibenzo[a,d]cycloheptene analogues of clozapine to dopamine and serotonin receptors. J Med Chem37:2686-96 (1994) 5-hydroxytryptamine receptor 2C
Name:5-hydroxytryptamine receptor 2C
Type:Enzyme
Mol. Mass.:51935.10
Organism:Rattus norvegicus (Rat)
Description:P08909
Residue:460
BDBM50028600
NameBDBM50028600
Synonyms:1-(8-Chloro-dibenzo[b,f]oxepin-10-yl)-4-methyl-piperazine | CHEMBL90882
TypeSmall organic molecule
Emp. Form.C19H19ClN2O
Mol. Mass.326.82
SMILESCN1CCN(CC1)C1=Cc2ccccc2Oc2ccc(Cl)cc12