Reaction Details
Target5-hydroxytryptamine receptor 2A
LigandBDBM50010594
Substrate/Competitorn/a
Meas. Tech.ChEMBL_2609 (CHEMBL617477)
Ki 7±n/a nM
Citation Phillips, STde Paulis, TBaron, BMSiegel, BWSeeman, PVan Tol, HHGuan, HCSmith, HE Binding of 5H-dibenzo[b,e][1,4]diazepine and chiral 5H-dibenzo[a,d]cycloheptene analogues of clozapine to dopamine and serotonin receptors. J Med Chem37:2686-96 (1994) 5-hydroxytryptamine receptor 2A
Name:5-hydroxytryptamine receptor 2A
Type:G Protein-Coupled Receptor (GPCR)
Mol. Mass.:52852.05
Organism:Rattus norvegicus (rat)
Description:Rat cortex membranes 5-HT2A receptors.
Residue:471
BDBM50010594
NameBDBM50010594
Synonyms:2-Chloro-11-(4-methyl-piperazin-1-yl)-5H-dibenzo[b,e][1,4]diazepine CHEMBL415300 | ISOCLOZAPINE
TypeSmall organic molecule
Emp. Form.C18H19ClN4
Mol. Mass.326.823
SMILESCN1CCN(CC1)C1=Nc2ccccc2Nc2ccc(Cl)cc12