Reaction Details
TargetRetinoic acid receptor beta
LigandBDBM50040021
Substrate/Competitorn/a
Meas. Tech.ChEMBL_196658 (CHEMBL799693)
EC50>10000±n/a nM
Citation Boehm, MFZhang, LBadea, BAWhite, SKMais, DEBerger, ESuto, CMGoldman, MEHeyman, RA Synthesis and structure-activity relationships of novel retinoid X receptor-selective retinoids. J Med Chem37:2930-41 (1994) Retinoic acid receptor beta
Name:Retinoic acid receptor beta
Type:PROTEIN
Mol. Mass.:50498.70
Organism:Homo sapiens (Human)
Description:ChEMBL_1458015
Residue:455
BDBM50040021
NameBDBM50040021
Synonyms:4-[1-(3-Isopropyl-5,5,8,8-tetramethyl-5,6,7,8-tetrahydro-naphthalen-2-yl)-vinyl]-benzoic acid | CHEMBL99325
TypeSmall organic molecule
Emp. Form.C26H32O2
Mol. Mass.376.5311
SMILESCC(C)c1cc2c(cc1C(=C)c1ccc(cc1)C(O)=O)C(C)(C)CCC2(C)C