Reaction Details
TargetRetinoic acid receptor RXR-beta
LigandBDBM50033079
Substrate/Competitorn/a
Meas. Tech.ChEMBL_196631 (CHEMBL798185)
Kd 199±n/a nM
Citation Boehm, MFZhang, LBadea, BAWhite, SKMais, DEBerger, ESuto, CMGoldman, MEHeyman, RA Synthesis and structure-activity relationships of novel retinoid X receptor-selective retinoids. J Med Chem37:2930-41 (1994) Retinoic acid receptor RXR-beta
Name:Retinoic acid receptor RXR-beta
Type:PROTEIN
Mol. Mass.:55877.78
Organism:Mus musculus
Description:ChEMBL_196588
Residue:520
BDBM50033079
NameBDBM50033079
Synonyms:4-[1-(5,5,8,8-Tetramethyl-5,6,7,8-tetrahydro-naphthalen-2-yl)-vinyl]-benzoic acid | CHEMBL96184
TypeSmall organic molecule
Emp. Form.C23H26O2
Mol. Mass.334.4513
SMILESCC1(C)CCC(C)(C)c2cc(ccc12)C(=C)c1ccc(cc1)C(O)=O