Reaction Details
TargetHistamine H1 receptor
LigandBDBM50040117
Substrate/Competitorn/a
Meas. Tech.ChEMBL_83929 (CHEMBL693694)
Ki 500±n/a nM
Citation Ohshima, ETakami, HHarakawa, HSato, HObase, HMiki, IIshii, AIshii, HSasaki, YOhmori, K Dibenz[b,e]oxepin derivatives: novel antiallergic agents possessing thromboxane A2 and histamine H1 dual antagonizing activity. 1. J Med Chem36:417-20 (1993) Histamine H1 receptor
Name:Histamine H1 receptor
Type:G Protein-Coupled Receptor (GPCR)
Mol. Mass.:55641.53
Organism:Cavia porcellus (domestic guinea pig)
Description:Guinea pig cerebellum was used in binding assay.
Residue:488
BDBM50040117
NameBDBM50040117
Synonyms:11-{2-[4-(2-Oxo-2,3-dihydro-benzoimidazol-1-yl)-piperidin-1-yl]-ethylsulfanyl}-6,11-dihydro-dibenzo[b,e]oxepine-2-carboxylic acid | CHEMBL131648
TypeSmall organic molecule
Emp. Form.C29H29N3O4S
Mol. Mass.515.623
SMILESOC(=O)c1ccc2OCc3ccccc3C(SCCN3CCC(CC3)n3c4ccccc4[nH]c3=O)c2c1