Reaction Details
TargetKappa-type opioid receptor
LigandBDBM50040124
Substrate/Competitorn/a
Meas. Tech.ChEMBL_223427 (CHEMBL845230)
IC50 0.522000±n/a nM
Citation Kawasaki, AMKnapp, RJKramer, THWalton, AWire, WSHashimoto, SYamamura, HIPorreca, FBurks, TFHruby, VJ Design and synthesis of highly potent and selective cyclic dynorphin A analogs. 2. New analogs. J Med Chem36:750-7 (1993) Kappa-type opioid receptor
Name:Kappa-type opioid receptor
Type:G Protein-Coupled Receptor (GPCR)
Mol. Mass.:42744.99
Organism:Cavia porcellus (domestic guinea pig)
Description:P41144
Residue:380
BDBM50040124
NameBDBM50040124
Synonyms:CHEMBL414494 | Tyr-Gly-Gly-Phe-c((L-Pen)-Arg-Arg-Ile-Arg-Pro-Cys)
TypeSmall organic molecule
Emp. Form.C59H92N20O13S2
Mol. Mass.1353.618
SMILESCC[C@H](C)[C@H]1NC(=O)[C@H](CCCNC(N)=N)NC(=O)[C@@H](CCCNC(N)=N)NC(=O)[C@H](NC(=O)[C@H](Cc2ccccc2)NC(=O)CNC(=O)CNC(=O)[C@@H](N)Cc2ccc(O)cc2)C(C)(C)SSC[C@@H](NC(=O)[C@H]2CCCN2C(=O)[C@H](CCCNC(N)=N)NC1=O)C(O)=O