Reaction Details
TargetMu-type opioid receptor
LigandBDBM50002184
Substrate/Competitorn/a
Meas. Tech.ChEMBL_221944 (CHEMBL844217)
Ki 0.19±n/a nM
Citation Snyder, KRMurray, TFDeLander, GEAldrich, JV Synthesis and opioid activity of dynorphin A-(1-13)NH2 analogues containing cis- and trans-4-aminocyclohexanecarboxylic acid. J Med Chem36:1100-3 (1993) Mu-type opioid receptor
Name:Mu-type opioid receptor
Type:G Protein-Coupled Receptor (GPCR)
Mol. Mass.:44503.11
Organism:Rattus norvegicus (rat)
Description:Competition binding assays were carried out using membrane preparations from transfected HN9.10 cells that constitutively expressed the mu opioid receptor.
Residue:398
BDBM50002184
NameBDBM50002184
Synonyms:CHEMBL415330 Linear Dyn A-(1-13)NH2 Tyr-Gly-Gly-Phe-Leu-Arg-Arg-Ile-Arg-Pro-Lys-Leu-Lys-NH2
TypeSmall organic molecule
Emp. Form.C75H127N25O14
Mol. Mass.1602.97
SMILESCC[C@H](C)[C@H](NC(=O)[C@H](CCCNC(N)=N)NC(=O)[C@H](CCCNC(N)=N)NC(=O)[C@H](CC(C)C)NC(=O)[C@H](Cc1ccccc1)NC(=O)CNC(=O)CNC(=O)[C@@H](N)Cc1ccc(O)cc1)C(=O)N[C@@H](CCCNC(N)=N)C(=O)N1CCC[C@H]1C(=O)N[C@@H](CCCCN)C(=O)N[C@@H](CC(C)C)C(=O)N[C@@H](CCCCN)C(N)=O