Reaction Details
TargetEpidermal growth factor receptor
LigandBDBM50040930
Substrate/Competitorn/a
Meas. Tech.ChEMBL_5002 (CHEMBL621149)
IC50 2200±n/a nM
Citation Trinks, UBuchdunger, EFuret, PKump, WMett, HMeyer, TMüller, MRegenass, URihs, GLydon, N Dianilinophthalimides: potent and selective, ATP-competitive inhibitors of the EGF-receptor protein tyrosine kinase. J Med Chem37:1015-27 (1994) Epidermal growth factor receptor
Name:Epidermal growth factor receptor
Type:Receptor Kinase Domain
Mol. Mass.:134279.59
Organism:Homo sapiens (Human)
Description:P00533
Residue:1210
BDBM50040930
NameBDBM50040930
Synonyms:5,6-Bis-(4-fluoro-phenylamino)-isoindole-1,3-dione | CHEMBL7939
TypeSmall organic molecule
Emp. Form.C20H13F2N3O2
Mol. Mass.365.3329
SMILESFc1ccc(Nc2cc3C(=O)NC(=O)c3cc2Nc2ccc(F)cc2)cc1