Reaction Details
TargetProto-oncogene tyrosine-protein kinase Src
LigandBDBM50040929
Substrate/Competitorn/a
Meas. Tech.ChEMBL_216999 (CHEMBL821534)
IC50 16000±n/a nM
Citation Trinks, UBuchdunger, EFuret, PKump, WMett, HMeyer, TMüller, MRegenass, URihs, GLydon, N Dianilinophthalimides: potent and selective, ATP-competitive inhibitors of the EGF-receptor protein tyrosine kinase. J Med Chem37:1015-27 (1994) Proto-oncogene tyrosine-protein kinase Src
Name:Proto-oncogene tyrosine-protein kinase Src
Type:Protein
Mol. Mass.:59838.60
Organism:Homo sapiens (Human)
Description:P12931
Residue:536
BDBM50040929
NameBDBM50040929
Synonyms:4,5-dianilinophthalimide CHEMBL268868 | Cgp 52411
TypeSmall organic molecule
Emp. Form.C20H15N3O2
Mol. Mass.329.352
SMILESO=C1NC(=O)c2cc(Nc3ccccc3)c(Nc3ccccc3)cc12