Reaction Details
TargetcAMP-dependent protein kinase
LigandBDBM50040927
Substrate/Competitorn/a
Meas. Tech.ChEMBL_152945 (CHEMBL874643)
IC50>500000±n/a nM
Citation Trinks, UBuchdunger, EFuret, PKump, WMett, HMeyer, TMüller, MRegenass, URihs, GLydon, N Dianilinophthalimides: potent and selective, ATP-competitive inhibitors of the EGF-receptor protein tyrosine kinase. J Med Chem37:1015-27 (1994) cAMP-dependent protein kinase
Name:cAMP-dependent protein kinase
Type:Enzyme
Mol. Mass.:40766.33
Organism:Oryctolagus cuniculus (Rabbit)
Description:Q95J97
Residue:351
BDBM50040927
NameBDBM50040927
Synonyms:CHEMBL268441 | N-(1,3-Dioxo-6-phenylamino-2,3-dihydro-1H-isoindol-5-yl)-N-phenyl-acetamide
TypeSmall organic molecule
Emp. Form.C22H17N3O3
Mol. Mass.371.3887
SMILESCC(=O)N(c1ccccc1)c1cc2C(=O)NC(=O)c2cc1Nc1ccccc1