Reaction Details
TargetcAMP-dependent protein kinase
LigandBDBM50040928
Substrate/Competitorn/a
Meas. Tech.ChEMBL_152945 (CHEMBL874643)
IC50>500000±n/a nM
Citation Trinks, UBuchdunger, EFuret, PKump, WMett, HMeyer, TMüller, MRegenass, URihs, GLydon, N Dianilinophthalimides: potent and selective, ATP-competitive inhibitors of the EGF-receptor protein tyrosine kinase. J Med Chem37:1015-27 (1994) cAMP-dependent protein kinase
Name:cAMP-dependent protein kinase
Type:Enzyme
Mol. Mass.:40766.33
Organism:Oryctolagus cuniculus (Rabbit)
Description:Q95J97
Residue:351
BDBM50040928
NameBDBM50040928
Synonyms:4-[6-(4-cyanoanilino)-1,3-dioxo-2,3-dihydro-1H-5-isoindolylamino]benzonitrile | CHEMBL267869
TypeSmall organic molecule
Emp. Form.C22H13N5O2
Mol. Mass.379.3709
SMILESO=C1NC(=O)c2cc(Nc3ccc(cc3)C#N)c(Nc3ccc(cc3)C#N)cc12