Reaction Details
TargetcAMP-dependent protein kinase
LigandBDBM50040923
Substrate/Competitorn/a
Meas. Tech.ChEMBL_152945 (CHEMBL874643)
IC50>500000±n/a nM
Citation Trinks, UBuchdunger, EFuret, PKump, WMett, HMeyer, TMüller, MRegenass, URihs, GLydon, N Dianilinophthalimides: potent and selective, ATP-competitive inhibitors of the EGF-receptor protein tyrosine kinase. J Med Chem37:1015-27 (1994) cAMP-dependent protein kinase
Name:cAMP-dependent protein kinase
Type:Enzyme
Mol. Mass.:40766.33
Organism:Oryctolagus cuniculus (Rabbit)
Description:Q95J97
Residue:351
BDBM50040923
NameBDBM50040923
Synonyms:2-Methyl-5,6-bis-phenylamino-isoindole-1,3-dione N-Methyl-4,5-dianilinophthalimide
TypeSmall organic molecule
Emp. Form.C21H17N3O2
Mol. Mass.343.3786
SMILESCN1C(=O)c2cc(Nc3ccccc3)c(Nc3ccccc3)cc2C1=O