Reaction Details
TargetNeutrophil elastase
LigandBDBM50037375
Substrate/Competitorn/a
Meas. Tech.ChEMBL_63996 (CHEMBL673105)
Ki 8±n/a nM
Citation Brown, FJAndisik, DWBernstein, PRBryant, CBCeccarelli, CDamewood, JREdwards, PDEarley, RAFeeney, SGreen, RC Design of orally active, non-peptidic inhibitors of human leukocyte elastase. J Med Chem37:1259-61 (1994) Neutrophil elastase
Name:Neutrophil elastase
Type:Enzyme
Mol. Mass.:28532.38
Organism:Homo sapiens (Human)
Description:P08246
Residue:267
BDBM50037375
NameBDBM50037375
Synonyms:CHEMBL275043 | {2-Oxo-6-phenyl-1-[(3,3,3-trifluoro-1-isopropyl-2-oxo-propylcarbamoyl)-methyl]-1,2-dihydro-pyridin-3-yl}-carbamic acid pyridin-4-ylmethyl ester
TypeSmall organic molecule
Emp. Form.C26H25F3N4O5
Mol. Mass.530.4957
SMILESCC(C)C(NC(=O)Cn1c(ccc(NC(=O)OCc2ccncc2)c1=O)-c1ccccc1)C(=O)C(F)(F)F