Reaction Details
TargetNeutrophil elastase
LigandBDBM50037348
Substrate/Competitorn/a
Meas. Tech.ChEMBL_63996 (CHEMBL673105)
Ki 1.8±n/a nM
Citation Brown, FJAndisik, DWBernstein, PRBryant, CBCeccarelli, CDamewood, JREdwards, PDEarley, RAFeeney, SGreen, RC Design of orally active, non-peptidic inhibitors of human leukocyte elastase. J Med Chem37:1259-61 (1994) Neutrophil elastase
Name:Neutrophil elastase
Type:Enzyme
Mol. Mass.:28532.38
Organism:Homo sapiens (Human)
Description:P08246
Residue:267
BDBM50037348
NameBDBM50037348
Synonyms:1N-(3,3,3-trifluoro-1-isopropyl-2-oxopropyl)-2-(3-amino-sulfonylaminobenzyl-2-oxo-6-phenyl-1,2-dihydro-1-pyridinyl)acetamide(0.25M H2O) CHEMBL282694
TypeSmall organic molecule
Emp. Form.C26H27F3N4O5S
Mol. Mass.564.577
SMILESCC(C)C(NC(=O)Cn1c(ccc(NS(=O)(=O)NCc2ccccc2)c1=O)-c1ccccc1)C(=O)C(F)(F)F