Reaction Details
TargetCysteinyl leukotriene receptor 1
LigandBDBM50041342
Substrate/Competitorn/a
Meas. Tech.ChEMBL_152998 (CHEMBL759482)
Ki 5.2±n/a nM
Citation Jacobs, RTBernstein, PRCronk, LAVacek, EPNewcomb, LFAharony, DBuckner, CKKusner, EJ Synthesis, structure-activity relationships, and pharmacological evaluation of a series of fluorinated 3-benzyl-5-indolecarboxamides: identification of 4-[[5-[((2R)-2-methyl-4,4,4-trifluorobutyl)carbamoyl]-1-methyl indol- 3-yl]methyl]-3-methoxy-N-[(2-methylphenyl)sulfonyl]benzamide, a potent, orall J Med Chem37:1282-97 (1994) Cysteinyl leukotriene receptor 1
Name:Cysteinyl leukotriene receptor 1
Type:Enzyme Catalytic Domain
Mol. Mass.:39007.58
Organism:GUINEA PIG
Description:Leukotriene D4 0 GUINEA PIG::Q2NNR5
Residue:340
BDBM50041342
NameBDBM50041342
Synonyms:3-[2-Methoxy-4-(toluene-2-sulfonylaminocarbonyl)-benzyl]-1-methyl-1H-indole-5-carboxylic acid (2-methyl-butyl)-amide | CHEMBL24613
TypeSmall organic molecule
Emp. Form.C31H35N3O5S
Mol. Mass.561.692
SMILESCCC(C)CNC(=O)c1ccc2n(C)cc(Cc3ccc(cc3OC)C(=O)NS(=O)(=O)c3ccccc3C)c2c1