Reaction Details
TargetEndothelin receptor type B
LigandBDBM50041617
Substrate/Competitorn/a
Meas. Tech.ChEMBL_63849 (CHEMBL673233)
Ki 14.7±n/a nM
Citation Elliott, JDLago, MACousins, RDGao, ALeber, JDErhard, KFNambi, PElshourbagy, NAKumar, CLee, JA 1,3-Diarylindan-2-carboxylic acids, potent and selective non-peptide endothelin receptor antagonists. J Med Chem37:1553-7 (1994) Endothelin receptor type B
Name:Endothelin receptor type B
Type:Enzyme Catalytic Domain
Mol. Mass.:49664.00
Organism:Homo sapiens (Human)
Description:ENDOTHELIN B EDNRB HUMAN::P24530
Residue:442
BDBM50041617
NameBDBM50041617
Synonyms:(1S,2R,3S)-1-Benzo[1,3]dioxol-5-yl-3-(2-carboxymethoxy-4-methoxy-phenyl)-5-propoxy-indan-2-carboxylic acid CHEMBL8823 SB-209670
TypeSmall organic molecule
Emp. Form.C29H28O9
Mol. Mass.520.5272
SMILESCCCOc1ccc2[C@@H]([C@H]([C@@H](c2c1)c1ccc(OC)cc1OCC(O)=O)C(O)=O)c1ccc2OCOc2c1