Reaction Details
Target3',5'-cyclic-AMP phosphodiesterase
LigandBDBM50041858
Substrate/Competitorn/a
Meas. Tech.ChEMBL_157209 (CHEMBL768860)
IC50 300±n/a nM
Citation Ashton, MJCook, DCFenton, GKarlsson, JAPalfreyman, MNRaeburn, DRatcliffe, AJSouness, JEThurairatnam, SVicker, N Selective type IV phosphodiesterase inhibitors as antiasthmatic agents. The syntheses and biological activities of 3-(cyclopentyloxy)-4-methoxybenzamides and analogues. J Med Chem37:1696-703 (1994) 3',5'-cyclic-AMP phosphodiesterase
Name:3',5'-cyclic-AMP phosphodiesterase
Synonyms:Phosphodiesterase 4A
Type:PROTEIN
Mol. Mass.:13615.65
Organism:Sus scrofa
Description:ChEMBL_155848
Residue:118
BDBM50041858
NameBDBM50041858
TypeSmall organic molecule
Emp. Form.C20H23NO3
Mol. Mass.325.4015
SMILESCOc1ccc(cc1OC1CCCC1)C(=O)Nc1ccccc1C