Reaction Details
TargetDihydrofolate reductase
LigandBDBM18268
Substrate/Competitorn/a
Meas. Tech.ChEMBL_53006 (CHEMBL664436)
IC50 42±n/a nM
Citation Rosowsky, AMota, CEWright, JEFreisheim, JHHeusner, JJMcCormack, JJQueener, SF 2,4-Diaminothieno[2,3-d]pyrimidine analogues of trimetrexate and piritrexim as potential inhibitors of Pneumocystis carinii and Toxoplasma gondii dihydrofolate reductase. J Med Chem36:3103-12 (1993) Dihydrofolate reductase
Name:Dihydrofolate reductase
Type:Enzyme
Mol. Mass.:17991.61
Organism:Escherichia coli
Description:E. coli DHFR was expressed in BL21, and purified to homogeneity.
Residue:159
BDBM18268
NameBDBM18268
Synonyms:5-methyl-6-{[(3,4,5-trimethoxyphenyl)amino]methyl}quinazoline-2,4-diamine TMQ US11111252, Compound TMQ | US11530198, Example Trimetrexate
TypeSmall organic molecule
Emp. Form.C19H23N5O3
Mol. Mass.369.4176
SMILESCOc1cc(NCc2ccc3nc(N)nc(N)c3c2C)cc(OC)c1OC