Reaction Details
TargetMu-type opioid receptor
LigandBDBM50043712
Substrate/Competitorn/a
Meas. Tech.ChEMBL_136094 (CHEMBL745616)
IC50 1100±n/a nM
Citation Misicka, ALipkowski, AWHorvath, RDavis, PYamamura, HIPorreca, FHruby, VJ Design of cyclic deltorphins and dermenkephalins with a disulfide bridge leads to analogues with high selectivity for delta-opioid receptors. J Med Chem37:141-5 (1994) Mu-type opioid receptor
Name:Mu-type opioid receptor
Type:Enzyme Catalytic Domain
Mol. Mass.:11165.58
Organism:GUINEA PIG
Description:P97266
Residue:98
BDBM50043712
NameBDBM50043712
Synonyms:CHEMBL286629 | {(4S,7R,10S,13R)-13-[(S)-2-Amino-3-(4-hydroxy-phenyl)-propionylamino]-10-benzyl-4-[(R)-1-(carbamoylmethyl-carbamoyl)-2-methyl-propylcarbamoyl]-3,3-dimethyl-6,9,12-trioxo-1,2-dithia-5,8,11-triaza-cyclotetradec-7-yl}-acetic acid
TypeSmall organic molecule
Emp. Form.C37H50N8O10S2
Mol. Mass.830.971
SMILESCC(C)[C@@H](NC(=O)[C@@H]1NC(=O)[C@@H](CC(O)=O)NC(=O)[C@H](Cc2ccccc2)NC(=O)[C@H](CSSC1(C)C)NC(=O)[C@@H](N)Cc1ccc(O)cc1)C(=O)NCC(N)=O