Reaction Details
TargetDelta-type opioid receptor
LigandBDBM50043718
Substrate/Competitorn/a
Meas. Tech.ChEMBL_145886 (CHEMBL754252)
IC50 3300±n/a nM
Citation Misicka, ALipkowski, AWHorvath, RDavis, PYamamura, HIPorreca, FHruby, VJ Design of cyclic deltorphins and dermenkephalins with a disulfide bridge leads to analogues with high selectivity for delta-opioid receptors. J Med Chem37:141-5 (1994) Delta-type opioid receptor
Name:Delta-type opioid receptor
Type:Enzyme Catalytic Domain
Mol. Mass.:40577.25
Organism:MOUSE
Description:P32300
Residue:372
BDBM50043718
NameBDBM50043718
Synonyms:(4R,10R,13S)-13-[(S)-2-Amino-3-(4-hydroxy-phenyl)-propionylamino]-10-benzyl-7-hydroxymethyl-3,3,14,14-tetramethyl-6,9,12-trioxo-1,2-dithia-5,8,11-triaza-cyclotetradecane-4-carboxylic acid [(R)-1-(carbamoylmethyl-carbamoyl)-2-methyl-propyl]-amide | CHEMBL2372213
TypeSmall organic molecule
Emp. Form.C38H54N8O9S2
Mol. Mass.831.014
SMILESCC(C)[C@H](NC(=O)[C@H]1NC(=O)[C@H](CO)NC(=O)[C@H](Cc2ccccc2)NC(=O)[C@H](NC(=O)[C@@H](N)Cc2ccc(O)cc2)C(C)(C)SSC1(C)C)C(=O)NCC(N)=O