Reaction Details
TargetMu-type opioid receptor
LigandBDBM50043716
Substrate/Competitorn/a
Meas. Tech.ChEMBL_138880 (CHEMBL747872)
IC50 4.83±n/a nM
Citation Misicka, ALipkowski, AWHorvath, RDavis, PYamamura, HIPorreca, FHruby, VJ Design of cyclic deltorphins and dermenkephalins with a disulfide bridge leads to analogues with high selectivity for delta-opioid receptors. J Med Chem37:141-5 (1994) Mu-type opioid receptor
Name:Mu-type opioid receptor
Type:G Protein-Coupled Receptor (GPCR)
Mol. Mass.:44503.11
Organism:Rattus norvegicus (rat)
Description:Competition binding assays were carried out using membrane preparations from transfected HN9.10 cells that constitutively expressed the mu opioid receptor.
Residue:398
BDBM50043716
NameBDBM50043716
Synonyms:CHEMBL2372212 | {(4R,10R,13S)-13-[(S)-2-Amino-3-(4-hydroxy-phenyl)-propionylamino]-10-benzyl-4-[1-(carbamoylmethyl-carbamoyl)-pentylcarbamoyl]-3,3,14,14-tetramethyl-6,9,12-trioxo-1,2-dithia-5,8,11-triaza-cyclotetradec-7-yl}-acetic acid
TypeSmall organic molecule
Emp. Form.C40H56N8O10S2
Mol. Mass.873.05
SMILESCCCC[C@H](NC(=O)[C@H]1NC(=O)[C@H](CC(O)=O)NC(=O)[C@H](Cc2ccccc2)NC(=O)[C@H](NC(=O)[C@@H](N)Cc2ccc(O)cc2)C(C)(C)SSC1(C)C)C(=O)NCC(N)=O