Reaction Details
TargetAngiotensin-converting enzyme
LigandBDBM50044868
Substrate/Competitorn/a
Meas. Tech.ChEBML_36152
Ki 0.004000±n/a nM
Citation Flynn, GABeight, DWMehdi, SKoehl, JRGiroux, ELFrench, JFHake, PWDage, RC Application of a conformationally restricted Phe-Leu dipeptide mimetic to the design of a combined inhibitor of angiotensin I-converting enzyme and neutral endopeptidase 24.11. J Med Chem36:2420-3 (1993) Angiotensin-converting enzyme
Name:Angiotensin-converting enzyme
Type:n/a
Mol. Mass.:150405.15
Organism:Oryctolagus cuniculus
Description:n/a
Residue:1310
BDBM50044868
NameBDBM50044868
Synonyms:7-(1-Carboxy-3-phenyl-propylamino)-6-oxo-1,2,3,4,6,7,8,12b-octahydro-benzo[c]pyrido[1,2-a]azepine-4-carboxylic acid | CHEMBL309424
TypeSmall organic molecule
Emp. Form.C25H28N2O5
Mol. Mass.436.5002
SMILESOC(=O)[C@H](CCc1ccccc1)N[C@@H]1Cc2ccccc2C2CCC[C@@H](N2C1=O)C(O)=O