Reaction Details
TargetAngiotensin-converting enzyme
LigandBDBM50044867
Substrate/Competitorn/a
Meas. Tech.ChEMBL_36152 (CHEMBL648339)
Ki 2±n/a nM
Citation Flynn, GABeight, DWMehdi, SKoehl, JRGiroux, ELFrench, JFHake, PWDage, RC Application of a conformationally restricted Phe-Leu dipeptide mimetic to the design of a combined inhibitor of angiotensin I-converting enzyme and neutral endopeptidase 24.11. J Med Chem36:2420-3 (1993) Angiotensin-converting enzyme
Name:Angiotensin-converting enzyme
Type:n/a
Mol. Mass.:150405.15
Organism:Oryctolagus cuniculus
Description:n/a
Residue:1310
BDBM50044867
NameBDBM50044867
Synonyms:7-Mercaptomethyl-6-oxo-1,2,3,4,6,7,8,12b-octahydro-benzo[c]pyrido[1,2-a]azepine-4-carboxylic acid | CHEMBL309836
TypeSmall organic molecule
Emp. Form.C16H19NO3S
Mol. Mass.305.392
SMILESOC(=O)[C@H]1CCCC2N1C(=O)[C@H](CS)Cc1ccccc21