Reaction Details
TargetRetinoic acid receptor beta
LigandBDBM50045266
Substrate/Competitorn/a
Meas. Tech.ChEBML_195796
EC50 15±n/a nM
Citation Jong, LLehmann, JMHobbs, PDHarlev, EHuffman, JCPfahl, MDawson, MI Conformational effects on retinoid receptor selectivity. 1. Effect of 9-double bond geometry on retinoid X receptor activity. J Med Chem36:2605-13 (1993) Retinoic acid receptor beta
Name:Retinoic acid receptor beta
Type:PROTEIN
Mol. Mass.:50498.70
Organism:Homo sapiens (Human)
Description:ChEMBL_1458015
Residue:455
BDBM50045266
NameBDBM50045266
Synonyms:4-[(E)-2-(4,4-Dimethyl-thiochroman-6-yl)-propenyl]-benzoic acid CHEMBL39344
TypeSmall organic molecule
Emp. Form.C21H22O2S
Mol. Mass.338.463
SMILESC\C(=C/c1ccc(cc1)C(O)=O)c1ccc2SCCC(C)(C)c2c1