Reaction Details
TargetCathepsin E
LigandBDBM50045288
Substrate/Competitorn/a
Meas. Tech.ChEBML_45334
Ki 44±n/a nM
Citation Rao, CMScarborough, PEKay, JBatley, BRapundalo, SKlutchko, STaylor, MDLunney, EAHumblet, CCDunn, BM Specificity in the binding of inhibitors to the active site of human/primate aspartic proteinases: analysis of P2-P1-P1'-P2' variation. J Med Chem36:2614-20 (1993) Cathepsin E
Name:Cathepsin E
Type:Enzyme
Mol. Mass.:43298.99
Organism:Homo sapiens (Human)
Description:P14091
Residue:396
BDBM50045288
NameBDBM50045288
Synonyms:CHEMBL329220 | N-(1-Cyclohexylmethyl-2,4-dihydroxy-hexyl)-3-[2-(morpholine-4-sulfonylamino)-3-phenyl-propionylamino]-succinamic acid methyl ester
TypeSmall organic molecule
Emp. Form.C31H50N4O9S
Mol. Mass.654.815
SMILESCC[C@@H](O)C[C@H](O)[C@H](CC1CCCCC1)NC(=O)[C@H](CC(=O)OC)NC(=O)[C@H](Cc1ccccc1)NS(=O)(=O)N1CCOCC1