Reaction Details
TargetCathepsin E
LigandBDBM50045289
Substrate/Competitorn/a
Meas. Tech.ChEBML_45334
Ki 15±n/a nM
Citation Rao, CMScarborough, PEKay, JBatley, BRapundalo, SKlutchko, STaylor, MDLunney, EAHumblet, CCDunn, BM Specificity in the binding of inhibitors to the active site of human/primate aspartic proteinases: analysis of P2-P1-P1'-P2' variation. J Med Chem36:2614-20 (1993) Cathepsin E
Name:Cathepsin E
Type:Enzyme
Mol. Mass.:43298.99
Organism:Homo sapiens (Human)
Description:P14091
Residue:396
BDBM50045289
NameBDBM50045289
Synonyms:6-(3-Methyl-thioureido)-2-[2-(morpholine-4-sulfonylamino)-3-phenyl-propionylamino]-hexanoic acid (1-cyclohexylmethyl-2,4-dihydroxy-hexyl)-amide | CHEMBL418948
TypeSmall organic molecule
Emp. Form.C34H58N6O7S2
Mol. Mass.726.99
SMILESCC[C@H](O)C[C@H](O)[C@H](CC1CCCCC1)NC(=O)[C@H](CCCCNC(=S)NC)NC(=O)[C@H](Cc1ccccc1)NS(=O)(=O)N1CCOCC1