Reaction Details
TargetG protein-activated inward rectifier potassium channel 4
LigandBDBM50497388
Substrate/Competitorn/a
Meas. Tech.ChEMBL_1443116 (CHEMBL3371676)
EC50 920±n/a nM
Citation Wen, WWu, WWeaver, CDLindsley, CW Discovery of potent and selective GIRK1/2 modulators via 'molecular switches' within a series of 1-(3-cyclopropyl-1-phenyl-1H-pyrazol-5-yl)ureas. Bioorg Med Chem Lett24:5102-6 (2014) 
 
G protein-activated inward rectifier potassium channel 4
Name:G protein-activated inward rectifier potassium channel 4
Type:PROTEIN
Mol. Mass.:47658.06
Organism:Homo sapiens (Human)
Description:ChEMBL_107914
Residue:419
BDBM50497388
NameBDBM50497388
Synonyms:CHEMBL3339137
TypeSmall organic molecule
Emp. Form.C20H17F3N4O
Mol. Mass.386.3704
SMILESFc1cccc(NC(=O)Nc2cc(nn2Cc2ccccc2)C2CC2(F)F)c1