Reaction Details
TargetPoly [ADP-ribose] polymerase tankyrase-1/tankyrase-2
LigandBDBM50188594
Substrate/Competitorn/a
Meas. Tech.ChEMBL_1440753 (CHEMBL3382566)
IC50 707±n/a nM
Citation Liscio, PCarotti, AAsciutti, SFerri, MPires, MMValloscuro, SZiff, JClark, NRMacchiarulo, AAaronson, SAPellicciari, RCamaioni, E Scaffold hopping approach on the route to selective tankyrase inhibitors. Eur J Med Chem87:611-23 (2014) 
 
Poly [ADP-ribose] polymerase tankyrase-1/tankyrase-2
Name:Poly [ADP-ribose] polymerase tankyrase-1/tankyrase-2
Synonyms:Tankyrase 1/2
Type:n/a
Mol. Mass.:n/a
Description:ASSAY_ID of ChEMBL is 1985233
Components:This complex has 2 components.
Component 1
Name:Poly [ADP-ribose] polymerase tankyrase-2
Type:Enzyme
Mol. Mass.:126937.16
Organism:Homo sapiens (Human)
Description:Q9H2K2
Residue:1166
Component 2
Name:Poly [ADP-ribose] polymerase tankyrase-1
Synonyms:(ARTD5 or PARP5a) PARPL Poly [ADP-ribose] polymerase tankyrase-1 TINF1 TNKS1 Tankyrase 1 Tankyrase-1 Tankyrase-1 (TNKS1)
Type:Enzyme
Mol. Mass.:142058.03
Organism:Homo sapiens (Human)
Description:O95271
Residue:1327
BDBM50188594
NameBDBM50188594
Synonyms:CHEBI:62878 | CHEMBL1086580
TypeSmall organic molecule
Emp. Form.C14H11F3N2OS
Mol. Mass.312.31
SMILESOc1nc(nc2CCSCc12)-c1ccc(cc1)C(F)(F)F