Reaction Details
TargetPoly [ADP-ribose] polymerase tankyrase-2
LigandBDBM50188594
Substrate/Competitorn/a
Meas. Tech.ChEMBL_1440752 (CHEMBL3382565)
IC50 3.6±n/a nM
Citation Liscio, PCarotti, AAsciutti, SFerri, MPires, MMValloscuro, SZiff, JClark, NRMacchiarulo, AAaronson, SAPellicciari, RCamaioni, E Scaffold hopping approach on the route to selective tankyrase inhibitors. Eur J Med Chem87:611-23 (2014) 
 
Poly [ADP-ribose] polymerase tankyrase-2
Name:Poly [ADP-ribose] polymerase tankyrase-2
Type:Enzyme
Mol. Mass.:126937.16
Organism:Homo sapiens (Human)
Description:Q9H2K2
Residue:1166
BDBM50188594
NameBDBM50188594
Synonyms:CHEBI:62878 | CHEMBL1086580
TypeSmall organic molecule
Emp. Form.C14H11F3N2OS
Mol. Mass.312.31
SMILESOc1nc(nc2CCSCc12)-c1ccc(cc1)C(F)(F)F