Reaction Details
TargetGastrin/cholecystokinin type B receptor
LigandBDBM50045796
Substrate/Competitorn/a
Meas. Tech.ChEMBL_48104 (CHEMBL663091)
Ki 6.1±n/a nM
Citation Blommaert, AGWeng, JHDorville, AMcCort, IDucos, BDurieux, CRoques, BP Cholecystokinin peptidomimetics as selective CCK-B antagonists: design, synthesis, and in vitro and in vivo biochemical properties. J Med Chem36:2868-77 (1993) Gastrin/cholecystokinin type B receptor
Name:Gastrin/cholecystokinin type B receptor
Type:G Protein-Coupled Receptor (GPCR)
Mol. Mass.:48445.79
Organism:Homo sapiens (Human)
Description:Stable expression of human CCK-2 receptors in HEK 293 cells.
Residue:447
BDBM50045796
NameBDBM50045796
Synonyms:CHEMBL99939 | {[2-(Adamantan-2-yloxycarbonylamino)-3-(1H-indol-3-yl)-2-methyl-propionyl]-[2-(4-chloro-phenyl)-ethyl]-amino}-acetic acid
TypeSmall organic molecule
Emp. Form.C33H38ClN3O5
Mol. Mass.592.125
SMILESCC(Cc1c[nH]c2ccccc12)(NC(=O)OC1[C@H]2C[C@@H]3C[C@@H](C[C@H]1C3)C2)C(=O)N(CCc1ccc(Cl)cc1)CC(O)=O