Reaction Details
TargetGastrin/cholecystokinin type B receptor
LigandBDBM50045800
Substrate/Competitorn/a
Meas. Tech.ChEMBL_48611 (CHEMBL659592)
Ki 40±n/a nM
Citation Blommaert, AGWeng, JHDorville, AMcCort, IDucos, BDurieux, CRoques, BP Cholecystokinin peptidomimetics as selective CCK-B antagonists: design, synthesis, and in vitro and in vivo biochemical properties. J Med Chem36:2868-77 (1993) Gastrin/cholecystokinin type B receptor
Name:Gastrin/cholecystokinin type B receptor
Type:Enzyme Catalytic Domain
Mol. Mass.:48980.43
Organism:RAT
Description:Cholecystokinin A CCKBR RAT::P30553
Residue:452
BDBM50045800
NameBDBM50045800
Synonyms:CHEMBL317999 | {[2-(Adamantan-2-yloxycarbonylamino)-3-(1H-indol-3-yl)-2-methyl-propionyl]-phenethyl-amino}-acetic acid
TypeSmall organic molecule
Emp. Form.C33H39N3O5
Mol. Mass.557.6799
SMILESCC(Cc1c[nH]c2ccccc12)(NC(=O)OC1[C@H]2C[C@@H]3C[C@@H](C[C@H]1C3)C2)C(=O)N(CCc1ccccc1)CC(O)=O