Reaction Details
TargetGastrin/cholecystokinin type B receptor
LigandBDBM50045813
Substrate/Competitorn/a
Meas. Tech.ChEBML_49880
Ki 79±n/a nM
Citation Blommaert, AGWeng, JHDorville, AMcCort, IDucos, BDurieux, CRoques, BP Cholecystokinin peptidomimetics as selective CCK-B antagonists: design, synthesis, and in vitro and in vivo biochemical properties. J Med Chem36:2868-77 (1993) Gastrin/cholecystokinin type B receptor
Name:Gastrin/cholecystokinin type B receptor
Type:G Protein-Coupled Receptor (GPCR)
Mol. Mass.:48445.79
Organism:Homo sapiens (Human)
Description:Stable expression of human CCK-2 receptors in HEK 293 cells.
Residue:447
BDBM50045813
NameBDBM50045813
Synonyms:CHEMBL328852 | {2-(1H-Indol-3-yl)-1-methyl-1-[2-(4-nitro-phenyl)-ethylcarbamoyl]-ethyl}-carbamic acid adamantan-2-yl ester
TypeSmall organic molecule
Emp. Form.C31H36N4O5
Mol. Mass.544.6413
SMILESCC(Cc1c[nH]c2ccccc12)(NC(=O)OC1[C@H]2C[C@@H]3C[C@@H](C[C@H]1C3)C2)C(=O)NCCc1ccc(cc1)[N+]([O-])=O