Reaction Details
TargetGastrin/cholecystokinin type B receptor
LigandBDBM50045808
Substrate/Competitorn/a
Meas. Tech.ChEBML_49880
Ki 51±n/a nM
Citation Blommaert, AGWeng, JHDorville, AMcCort, IDucos, BDurieux, CRoques, BP Cholecystokinin peptidomimetics as selective CCK-B antagonists: design, synthesis, and in vitro and in vivo biochemical properties. J Med Chem36:2868-77 (1993) Gastrin/cholecystokinin type B receptor
Name:Gastrin/cholecystokinin type B receptor
Type:G Protein-Coupled Receptor (GPCR)
Mol. Mass.:48445.79
Organism:Homo sapiens (Human)
Description:Stable expression of human CCK-2 receptors in HEK 293 cells.
Residue:447
BDBM50045808
NameBDBM50045808
Synonyms:CHEMBL432389 | [1-[2-(4-Bromo-phenyl)-ethylcarbamoyl]-2-(1H-indol-3-yl)-1-methyl-ethyl]-carbamic acid adamantan-2-yl ester
TypeSmall organic molecule
Emp. Form.C31H36BrN3O3
Mol. Mass.578.54
SMILESCC(Cc1c[nH]c2ccccc12)(NC(=O)OC1[C@H]2C[C@@H]3C[C@@H](C[C@H]1C3)C2)C(=O)NCCc1ccc(Br)cc1