Reaction Details
TargetTranslocator protein
LigandBDBM50045862
Substrate/Competitorn/a
Meas. Tech.ChEBML_218704
Ki 338±n/a nM
Citation Kozikowski, APMa, DBrewer, JSun, SCosta, ERomeo, EGuidotti, A Chemistry, binding affinities, and behavioral properties of a new class of"antineophobic" mitochondrial DBI receptor complex (mDRC) ligands. J Med Chem36:2908-20 (1993) Translocator protein
Name:Translocator protein
Type:Mitochondrion membrane protein
Mol. Mass.:18945.84
Organism:Rattus norvegicus (rat)
Description:Competitive binding experiments were performed on rat kidney mitochondrial membranes.
Residue:169
BDBM50045862
NameBDBM50045862
Synonyms:2-(2-Phenyl-1H-indol-3-yl)-1-pyrrolidin-1-yl-ethanone | CHEMBL329765
TypeSmall organic molecule
Emp. Form.C20H20N2O
Mol. Mass.304.3856
SMILESO=C(Cc1c([nH]c2ccccc12)-c1ccccc1)N1CCCC1