Reaction Details
TargetTranslocator protein
LigandBDBM50045855
Substrate/Competitorn/a
Meas. Tech.ChEBML_218704
Ki 328.0±n/a nM
Citation Kozikowski, APMa, DBrewer, JSun, SCosta, ERomeo, EGuidotti, A Chemistry, binding affinities, and behavioral properties of a new class of"antineophobic" mitochondrial DBI receptor complex (mDRC) ligands. J Med Chem36:2908-20 (1993) Translocator protein
Name:Translocator protein
Type:Mitochondrion membrane protein
Mol. Mass.:18945.84
Organism:Rattus norvegicus (rat)
Description:Competitive binding experiments were performed on rat kidney mitochondrial membranes.
Residue:169
BDBM50045855
NameBDBM50045855
Synonyms:2-(6,7-Dihydro-5H-benzo[3,4]azepino[1,2-a]indol-13-yl)-N,N-dipropyl-acetamide | CHEMBL327952
TypeSmall organic molecule
Emp. Form.C25H30N2O
Mol. Mass.374.5185
SMILESCCCN(CCC)C(=O)Cc1c2-c3ccccc3CCCn2c2ccccc12