Reaction Details
TargetAmiloride-sensitive amine oxidase [copper-containing]
LigandBDBM50046194
Substrate/Competitorn/a
Meas. Tech.ChEBML_53893
IC50 8050.0±n/a nM
Citation Stanek, JCaravatti, GCapraro, HGFuret, PMett, HSchneider, PRegenass, U S-adenosylmethionine decarboxylase inhibitors: new aryl and heteroaryl analogues of methylglyoxal bis(guanylhydrazone). J Med Chem36:46-54 (1993) Amiloride-sensitive amine oxidase [copper-containing]
Name:Amiloride-sensitive amine oxidase [copper-containing]
Type:PROTEIN
Mol. Mass.:85028.72
Organism:Rattus norvegicus
Description:ChEMBL_53893
Residue:746
BDBM50046194
NameBDBM50046194
Synonyms:4-((E)-{[(E)-amino(imino)methyl]hydrazono}methyl)pyrimidine-2-carboximidamide | CHEMBL151255
TypeSmall organic molecule
Emp. Form.C7H10N8
Mol. Mass.206.2079
SMILESNC(=N)NN=Cc1ccnc(n1)C(N)=N