Reaction Details
TargetNeuropeptide Y receptor type 1
LigandBDBM50046556
Substrate/Competitorn/a
Meas. Tech.ChEMBL_144145 (CHEMBL750760)
Ki>1000±n/a nM
Citation Kirby, DAKoerber, SCCraig, AGFeinstein, RDDelmas, LBrown, MRRivier, JE Defining structural requirements for neuropeptide Y receptors using truncated and conformationally restricted analogues. J Med Chem36:385-93 (1993) Neuropeptide Y receptor type 1
Name:Neuropeptide Y receptor type 1
Type:Enzyme Catalytic Domain
Mol. Mass.:44399.07
Organism:Homo sapiens (Human)
Description:NPY-Y1 NPY1R HUMAN::P25929
Residue:384
BDBM50046556
NameBDBM50046556
Synonyms:CHEMBL2370633 | Tyr-c(Glu-Ser-Lys-Pro-(D-Ala)-Arg-His-(DDpr))-Ile-Asn-Leu-Ile-Thr-Arg-Gln-Arg-Tyr
TypeSmall organic molecule
Emp. Form.C97H155N33O26
Mol. Mass.2199.4741
SMILES[H][C@@]12CCCN1C(=O)[C@H](CCCCN)NC(=O)[C@H](CO)NC(=O)[C@H](CCC(=O)N[C@@H](CNC(=O)[C@H](Cc1c[nH]cn1)NC(=O)[C@H](CCCN=C(N)N)NC(=O)CNC2=O)C(=O)N[C@@H]([C@@H](C)CC)C(=O)N[C@@H](CC(N)=O)C(=O)N[C@@H](CC(C)C)C(=O)N[C@@H]([C@@H](C)CC)C(=O)N[C@@H]([C@@H](C)O)C(=O)N[C@@H](CCCN=C(N)N)C(=O)N[C@@H](CCC(N)=O)C(=O)N[C@@H](CCCN=C(N)N)C(=O)N[C@@H](Cc1ccc(O)cc1)C(O)=O)NC(=O)[C@@H](N)Cc1ccc(O)cc1